[Main Page]

Installing AngularJS web client

_.-~= Installing AngularJS web client
make: *** [debian-stretch-packager] Error 2
Wed Jul 29 16:25:38 EDT 2020
Running npm install:
npm WARN deprecated chokidar@1.7.0: Chokidar 2 will break on node v14+. Upgrade to chokidar 3 with 15x less dependencies.
npm WARN deprecated core-js@2.6.11: core-js@<3 is no longer maintained and not recommended for usage due to the number of issues. Please, upgrade your dependencies to the actual version of core-js@3.
npm WARN deprecated fsevents@1.2.13: fsevents 1 will break on node v14+ and could be using insecure binaries. Upgrade to fsevents 2.
npm WARN deprecated json3@3.3.2: Please use the native JSON object instead of JSON 3
npm WARN deprecated chokidar@2.1.8: Chokidar 2 will break on node v14+. Upgrade to chokidar 3 with 15x less dependencies.
npm WARN deprecated resolve-url@0.2.1: https://github.com/lydell/resolve-url#deprecated
npm WARN deprecated urix@0.1.0: Please see https://github.com/lydell/urix#deprecated
npm ERR! code E404
npm ERR! 404 Not Found - GET https://registry.npmjs.org/@glidejs%2fglide - Not found
npm ERR! 404 
npm ERR! 404  '@glidejs/glide@^3.3.0' is not in the npm registry.
npm ERR! 404 You should bug the author to publish it (or use the name yourself!)
npm ERR! 404 It was specified as a dependency of 'staff'
npm ERR! 404 
npm ERR! 404 Note that you can also install from a
npm ERR! 404 tarball, folder, http url, or git url.

npm ERR! A complete log of this run can be found in:
npm ERR!     /home/test/.npm/_logs/2020-07-29T20_26_03_307Z-debug.log
Return Value = 1
Running npm run build-prod:

> evergreen-staff-client@0.0.1 build-prod /home/test/Evergreen/Open-ILS/web/js/ui/default/staff
> webpack --env.prod

sh: webpack: command not found
npm ERR! code ELIFECYCLE
npm ERR! syscall spawn
npm ERR! file sh
npm ERR! errno ENOENT
npm ERR! evergreen-staff-client@0.0.1 build-prod: `webpack --env.prod`
npm ERR! spawn ENOENT
npm ERR! 
npm ERR! Failed at the evergreen-staff-client@0.0.1 build-prod script.
npm ERR! This is probably not a problem with npm. There is likely additional logging output above.
npm WARN Local package.json exists, but node_modules missing, did you mean to install?

npm ERR! A complete log of this run can be found in:
npm ERR!     /home/test/.npm/_logs/2020-07-29T20_26_03_756Z-debug.log
Return Value = 1
Running npm run test:

> evergreen-staff-client@0.0.1 test /home/test/Evergreen/Open-ILS/web/js/ui/default/staff
> npm run create-mock-idl ; karma start test/karma.conf --single-run; npm run remove-mock-idl


> evergreen-staff-client@0.0.1 create-mock-idl /home/test/Evergreen/Open-ILS/web/js/ui/default/staff
> cd test/data && perl idl2js.pl

sh: karma: command not found

> evergreen-staff-client@0.0.1 remove-mock-idl /home/test/Evergreen/Open-ILS/web/js/ui/default/staff
> rm test/data/IDL2js.js

Return Value = 0
Return Value = 0
End of Installing AngularJS web client =~-._